Submit your inspiring success story or innovative use case to the 2022 Dataiku Frontrunner Awards! ENTER YOUR SUBMISSION

Error using the audit dataset plugin

sbourgeois-k
Level 2
Error using the audit dataset plugin

Hello,

I have just installed the audit dataset plugin (https://www.dataiku.com/product/plugins/dataset-audit/) that I then tried on an HDFS dataset.

Here the error I encountered after running the recipe :

Error while compiling statement: FAILED: SemanticException [Error 10001]: Line 1:424 Table not found 'test', caused by: HiveSQLException: Error while compiling statement: FAILED: SemanticException [Error 10001]: Line 1:424 Table not found 'test', caused by: HiveSQLException: Error while compiling statement: FAILED: SemanticException [Error 10001]: Line 1:424 Table not found 'test', caused by: SemanticException: Line 1:424 Table not found 'test', caused by: SemanticException: Line 1:424 Table not found 'test'".

How can I get rid of this error?

0 Kudos
1 Reply
AlexT
Dataiker
Dataiker

Hi @sbourgeois-k ,

As this plugin is not fully compatible with HDFS and has not been updated in a while and it's in our backlog. 

There are other ways to calculate the statistics of HDFS datasets depending on your use cases and what you would like to achieve.

You might be able to utilize DSS's metrics feature (https://doc.dataiku.com/dss/latest/scenarios/metrics.html) for calculating the metrics of your datasets.

Thanks,

0 Kudos

Labels

?
Labels (2)
A banner prompting to get Dataiku